Target
Melatonin receptor type 1A
Ligand
BDBM50144225
Substrate
Meas. Tech.
ChEMBL_1551499 (CHEMBL3762920)
Ki
24±n/a nM
Citation
 Landagaray, EEttaoussi, MDuroux, RBoutin, JACaignard, DHDelagrange, PMelnyk, PBerthelot, PYous, S Melatonergic ligands: Design, synthesis and pharmacological evaluation of novel series of naphthofuranic derivatives. Eur J Med Chem 109:360-70 (2016)  
Target
Name:
Melatonin receptor type 1A
Synonyms:
MTNR1A MTR1A_HUMAN Mel1a melatonin receptor Melatonin receptor Melatonin receptor type 1 (MT1) | Melatonin receptor type 1A
Type:
Enzyme
Mol. Mass.:
39392.94
Organism:
Homo sapiens (Human)
Description:
P48039
Residue:
350
  
Inhibitor
Name:
BDBM50144225
Synonyms:
CHEMBL3759606
Type:
Small organic molecule
Emp. Form.:
C19H19NO3
Mol. Mass.:
309.3591
SMILES:
COc1ccc2ccc3occ(CCNC(=O)C4CC4)c3c2c1
: