Target
Melatonin receptor type 1B
Ligand
BDBM50144310
Substrate
Meas. Tech.
ChEMBL_1551498 (CHEMBL3762919)
Ki
0.700000±n/a nM
Citation
 Landagaray, EEttaoussi, MDuroux, RBoutin, JACaignard, DHDelagrange, PMelnyk, PBerthelot, PYous, S Melatonergic ligands: Design, synthesis and pharmacological evaluation of novel series of naphthofuranic derivatives. Eur J Med Chem 109:360-70 (2016)  
Target
Name:
Melatonin receptor type 1B
Synonyms:
MTNR1B Mel-1B-R Melatonin 1B Melatonin receptor type 1B | Melatonin receptor type 2 (MT2)
Type:
Enzyme
Mol. Mass.:
40203.54
Organism:
Homo sapiens (Human)
Description:
P49286
Residue:
362
  
Inhibitor
Name:
BDBM50144310
Synonyms:
CHEMBL3759084
Type:
Small organic molecule
Emp. Form.:
C16H14FNO3
Mol. Mass.:
287.2857
SMILES:
COc1ccc2ccc3oc(CNC(=O)CF)cc3c2c1
: