Target
Melatonin receptor type 1A
Ligand
BDBM50144224
Substrate
Meas. Tech.
ChEMBL_1551497 (CHEMBL3762918)
EC50
1.000000±n/a nM
Citation
 Landagaray, EEttaoussi, MDuroux, RBoutin, JACaignard, DHDelagrange, PMelnyk, PBerthelot, PYous, S Melatonergic ligands: Design, synthesis and pharmacological evaluation of novel series of naphthofuranic derivatives. Eur J Med Chem 109:360-70 (2016)  
Target
Name:
Melatonin receptor type 1A
Synonyms:
MTNR1A MTR1A_HUMAN Mel1a melatonin receptor Melatonin receptor Melatonin receptor type 1 (MT1) | Melatonin receptor type 1A
Type:
Enzyme
Mol. Mass.:
39392.94
Organism:
Homo sapiens (Human)
Description:
P48039
Residue:
350
  
Inhibitor
Name:
BDBM50144224
Synonyms:
CHEMBL3759816
Type:
Small organic molecule
Emp. Form.:
C18H17NO3
Mol. Mass.:
295.3325
SMILES:
COc1ccc2ccc3occ(CNC(=O)C4CC4)c3c2c1
: