Target
Casein kinase II subunit alpha'
Ligand
BDBM50420563
Substrate
Meas. Tech.
ChEMBL_1552124 (CHEMBL3760461)
IC50
11±n/a nM
Citation
 Ohno, HMinamiguchi, DNakamura, SShu, KOkazaki, SHonda, MMisu, RMoriwaki, HNakanishi, SOishi, SKinoshita, TNakanishi, IFujii, N Structure-activity relationship study of 4-(thiazol-5-yl)benzoic acid derivatives as potent protein kinase CK2 inhibitors. Bioorg Med Chem 24:1136-41 (2016)  
Target
Name:
Casein kinase II subunit alpha'
Synonyms:
CK2A2 CSNK2A2 Casein kinase II alpha' Casein kinase II subunit alpha (CSNK2A2)
Type:
Protein
Mol. Mass.:
41223.82
Organism:
Homo sapiens (Human)
Description:
Residue:
350
  
Inhibitor
Name:
BDBM50420563
Synonyms:
CHEMBL2087023
Type:
Small organic molecule
Emp. Form.:
C18H14N2O4S
Mol. Mass.:
354.38
SMILES:
COc1ccc(cc1)C(=O)Nc1ncc(s1)-c1ccc(cc1)C(O)=O
: