Target
Casein kinase II subunit alpha
Ligand
BDBM50144677
Substrate
Meas. Tech.
ChEMBL_1552123 (CHEMBL3760460)
IC50
14±n/a nM
Citation
 Ohno, HMinamiguchi, DNakamura, SShu, KOkazaki, SHonda, MMisu, RMoriwaki, HNakanishi, SOishi, SKinoshita, TNakanishi, IFujii, N Structure-activity relationship study of 4-(thiazol-5-yl)benzoic acid derivatives as potent protein kinase CK2 inhibitors. Bioorg Med Chem 24:1136-41 (2016)  
Target
Name:
Casein kinase II subunit alpha
Synonyms:
CK II CK2- alpha CSK21_HUMAN Casein kinase 2 Casein kinase II alpha/beta Casein kinase II subunit alpha (CK2A1) Casein kinase II subunit alpha (CK2a V66A) Casein kinase II subunit alpha (CK2a)
Type:
Enzyme
Mol. Mass.:
45151.12
Organism:
Homo sapiens (Human)
Description:
P68400
Residue:
391
  
Inhibitor
Name:
BDBM50144677
Synonyms:
CHEMBL3758895
Type:
Small organic molecule
Emp. Form.:
C26H22N2O6S
Mol. Mass.:
490.528
SMILES:
COc1ccc(cc1)C(=O)Nc1ncc(s1)-c1ccc(cc1OCc1ccccc1OC)C(O)=O
: