Target
Carbonic anhydrase 1
Ligand
BDBM10886
Substrate
Meas. Tech.
ChEMBL_1552240 (CHEMBL3761242)
Ki
15±n/a nM
Citation
 Del Prete, SVullo, DDe Luca, VCarginale, VFerraroni, MOsman, SMAlOthman, ZSupuran, CTCapasso, C Sulfonamide inhibition studies of the฿-carbonic anhydrase from the pathogenic bacterium Vibrio cholerae. Bioorg Med Chem 24:1115-20 (2016)  
Target
Name:
Carbonic anhydrase 1
Synonyms:
CA-I CAB Carbonate dehydratase I Carbonic anhydrase 1 (CA I) Carbonic anhydrase 1 (Recombinant CA I) Carbonic anhydrase B Carbonic anhydrase I (CA I) Carbonic anhydrase I (CAI) Carbonic anhydrase isoenzyme I (hCA I) | hCA
Type:
Enzyme
Mol. Mass.:
28873.37
Organism:
Homo sapiens (Human)
Description:
P00915
Residue:
261
  
Inhibitor
Name:
BDBM10886
Synonyms:
2-N-benzene-1,3,4-thiadiazole-2,5-disulfonamide Benzolamide CHEMBL73962
Type:
Small organic molecule
Emp. Form.:
C8H8N4O4S3
Mol. Mass.:
320.369
SMILES:
NS(=O)(=O)c1nnc(NS(=O)(=O)c2ccccc2)s1
: