Target
Serine/threonine-protein kinase B-raf
Ligand
BDBM50139153
Substrate
Meas. Tech.
ChEMBL_1554489 (CHEMBL3767786)
IC50
2.0±n/a nM
Citation
 Huang, SCAdhikari, SAfroze, RBrewer, KCalderwood, EFChouitar, JEngland, DBFisher, CGalvin, KMGaulin, JGreenspan, PDHarrison, SJKim, MSLangston, SPMa, LTMenon, SMizutani, HRezaei, MSmith, MDZhang, DMGould, AE Optimization of tetrahydronaphthalene inhibitors of Raf with selectivity over hERG. Bioorg Med Chem Lett 26:1156-60 (2016)  
Target
Name:
Serine/threonine-protein kinase B-raf
Synonyms:
B-RAF B-Raf proto-oncogene serine/threonine-protein kinase BRAF1 RAFB1 v-Raf murine sarcoma viral oncogene homolog B1
Type:
Serine/threonine-protein kinase
Mol. Mass.:
84446.00
Organism:
Homo sapiens (Human)
Description:
P15056
Residue:
766
  
Inhibitor
Name:
BDBM50139153
Synonyms:
CHEMBL3765355
Type:
Small organic molecule
Emp. Form.:
C29H24F3N5O3
Mol. Mass.:
547.5278
SMILES:
FC(F)(F)c1cc(cc(c1)-c1cnc[nH]1)C(=O)N[C@@H]1CCc2ccc(Oc3ccnc4NC(=O)CCc34)cc2C1
: