Target
Serine/threonine-protein kinase B-raf
Ligand
BDBM50139157
Substrate
Meas. Tech.
ChEMBL_1554489 (CHEMBL3767786)
IC50
1.5±n/a nM
Citation
 Huang, SCAdhikari, SAfroze, RBrewer, KCalderwood, EFChouitar, JEngland, DBFisher, CGalvin, KMGaulin, JGreenspan, PDHarrison, SJKim, MSLangston, SPMa, LTMenon, SMizutani, HRezaei, MSmith, MDZhang, DMGould, AE Optimization of tetrahydronaphthalene inhibitors of Raf with selectivity over hERG. Bioorg Med Chem Lett 26:1156-60 (2016)  
Target
Name:
Serine/threonine-protein kinase B-raf
Synonyms:
B-RAF B-Raf proto-oncogene serine/threonine-protein kinase BRAF1 RAFB1 v-Raf murine sarcoma viral oncogene homolog B1
Type:
Serine/threonine-protein kinase
Mol. Mass.:
84446.00
Organism:
Homo sapiens (Human)
Description:
P15056
Residue:
766
  
Inhibitor
Name:
BDBM50139157
Synonyms:
CHEMBL3764588
Type:
Small organic molecule
Emp. Form.:
C30H27ClF3N5O3
Mol. Mass.:
598.015
SMILES:
Cl.Cn1nccc1-c1cc(cc(c1)C(F)(F)F)C(=O)N[C@@H]1CCc2ccc(Oc3ccnc4NC(=O)CCc34)cc2C1
: