Target
Interleukin-6 receptor subunit beta
Ligand
BDBM50145177
Substrate
Meas. Tech.
ChEMBL_1555122 (CHEMBL3768044)
IC50
1480±n/a nM
Citation
 Singh, SGajulapati, VGajulapati, KGoo, JIPark, YHJung, HYLee, SYChoi, JHKim, YKLee, KHeo, THChoi, Y Structure-activity relationship study of a series of novel oxazolidinone derivatives as IL-6 signaling blockers. Bioorg Med Chem Lett 26:1282-6 (2016)  
Target
Name:
Interleukin-6 receptor subunit beta
Synonyms:
CD_antigen=CD130 IL-6 receptor subunit beta IL-6R-beta IL6RB_HUMAN Interleukin-6 receptor subunit beta Membrane glycoprotein 130 gp130
Type:
PROTEIN
Mol. Mass.:
103525.80
Organism:
Homo sapiens (Human)
Description:
ChEMBL_108130
Residue:
918
  
Inhibitor
Name:
BDBM50145177
Synonyms:
CHEMBL3764956
Type:
Small organic molecule
Emp. Form.:
C21H31NO2
Mol. Mass.:
329.4763
SMILES:
CCCCCC(=C)[C@@H](O)[C@H](C)Cn1cc(CCO)c2ccccc12
: