Target
Type-2 angiotensin II receptor
Ligand
BDBM50049182
Substrate
Meas. Tech.
ChEMBL_1555129 (CHEMBL3768051)
Ki
40±n/a nM
Citation
 Sallander, JWallinder, CHallberg, AÅqvist, JGutiérrez-de-Terán, H Structural determinants of subtype selectivity and functional activity of angiotensin II receptors. Bioorg Med Chem Lett 26:1355-9 (2016)  
Target
Name:
Type-2 angiotensin II receptor
Synonyms:
AGTR2 AT2 Angiotensin II type 2 (AT-2) receptor Type-2 angiotensin II receptor
Type:
Enzyme Catalytic Domain
Mol. Mass.:
41201.61
Organism:
Homo sapiens (Human)
Description:
Angiotensin II, central 0 0::P50052
Residue:
363
  
Inhibitor
Name:
BDBM50049182
Synonyms:
(S)-5-Benzyloxy-2-diphenylacetyl-6-methoxy-1,2,3,4-tetrahydro-isoquinoline-3-carboxylic acid PD-126055
Type:
Small organic molecule
Emp. Form.:
C32H29NO5
Mol. Mass.:
507.5764
SMILES:
COc1ccc2CN([C@@H](Cc2c1OCc1ccccc1)C(O)=O)C(=O)C(c1ccccc1)c1ccccc1
: