Target
D(2) dopamine receptor
Ligand
BDBM50145585
Substrate
Meas. Tech.
ChEMBL_1556019 (CHEMBL3767683)
Ki
>10000±n/a nM
Citation
 Fiorino, FCiano, AMagli, ESeverino, BCorvino, APerissutti, EFrecentese, FDi Vaio, PIzzo, AACapasso, RMassarelli, PNencini, CRossi, IKedzierska, EOrzelska-Gòrka, JBielenica, ASantagada, VCaliendo, G Synthesis, in vitro and in vivo pharmacological evaluation of serotoninergic ligands containing an isonicotinic nucleus. Eur J Med Chem 110:133-50 (2016)  
Target
Name:
D(2) dopamine receptor
Synonyms:
DOPAMINE D2 DOPAMINE D2 Short Dopamine D2 receptor Drd2
Type:
G Protein-Coupled Receptor (GPCR)
Mol. Mass.:
50931.60
Organism:
Rattus norvegicus (rat)
Description:
P61169
Residue:
444
  
Inhibitor
Name:
BDBM50145585
Synonyms:
CHEMBL3765362
Type:
Small organic molecule
Emp. Form.:
C17H21N5O
Mol. Mass.:
311.3815
SMILES:
O=C(NCCN1CCN(CC1)c1ccccn1)c1ccncc1
: