Target
Amine oxidase [flavin-containing] A
Ligand
BDBM50145630
Substrate
Meas. Tech.
ChEMBL_1556050 (CHEMBL3767909)
Ki
560±n/a nM
Citation
 Mostert, SPetzer, APetzer, JP Inhibition of monoamine oxidase by benzoxathiolone analogues. Bioorg Med Chem Lett 26:1200-4 (2016)  
Target
Name:
Amine oxidase [flavin-containing] A
Synonyms:
AOFA_HUMAN MAO-A Monoamine oxidase Monoamine oxidase type A (MAO A) Monoamine oxidase type A (MAOA)
Type:
Protein
Mol. Mass.:
59689.53
Organism:
Homo sapiens (Human)
Description:
P21397
Residue:
527
  
Inhibitor
Name:
BDBM50145630
Synonyms:
CHEMBL3764447
Type:
Small organic molecule
Emp. Form.:
C14H9ClO3S
Mol. Mass.:
292.737
SMILES:
Clc1ccc(COc2ccc3sc(=O)oc3c2)cc1
: