Target
Androgen receptor
Ligand
BDBM50145862
Substrate
Meas. Tech.
ChEMBL_1553957 (CHEMBL3767969)
EC50
0.039800±n/a nM
Citation
 Saeed, AVaught, GMGavardinas, KMatthews, DGreen, JELosada, PGBullock, HACalvert, NAPatel, NJSweetana, SAKrishnan, VHenck, JWLuz, JGWang, YJadhav, P 2-Chloro-4-[[(1R,2R)-2-hydroxy-2-methyl-cyclopentyl]amino]-3-methyl-benzonitrile: A Transdermal Selective Androgen Receptor Modulator (SARM) for Muscle Atrophy. J Med Chem 59:750-5 (2016)  
Target
Name:
Androgen receptor
Synonyms:
ANDR_HUMAN Androgen Receptor Androgen receptor/Baculoviral IAP repeat-containing protein 2 Dihydrotestosterone receptor Nuclear receptor subfamily 3 group C member 4
Type:
Receptor
Mol. Mass.:
99185.27
Organism:
Homo sapiens (Human)
Description:
CHO cells were stably transfected with human AR gene.
Residue:
920
  
Inhibitor
Name:
BDBM50145862
Synonyms:
CHEMBL3765171
Type:
Small organic molecule
Emp. Form.:
C14H17ClN2O
Mol. Mass.:
264.751
SMILES:
Cc1c(N[C@@H]2CCC[C@]2(C)O)ccc(C#N)c1Cl
: