Target
Hepatocyte growth factor receptor
Ligand
BDBM50065457
Substrate
Meas. Tech.
ChEMBL_1555042 (CHEMBL3767620)
IC50
3.0±n/a nM
Citation
 Zhang, JJiang, XJiang, YGuo, MZhang, SLi, JHe, JLiu, JWang, JOuyang, L Recent advances in the development of dual VEGFR and c-Met small molecule inhibitors as anticancer drugs. Eur J Med Chem 108:495-504 (2016)  
Target
Name:
Hepatocyte growth factor receptor
Synonyms:
Hepatocyte growth factor receptor Hepatocyte growth factor receptor (c-MET) MET Met proto-oncogene (hepatocyte growth factor receptor) Tyrosine-protein kinase Met (c-Met) c-Met kinase
Type:
Protein
Mol. Mass.:
155559.73
Organism:
Homo sapiens (Human)
Description:
P08581
Residue:
1390
  
Inhibitor
Name:
BDBM50065457
Synonyms:
EMD-1214063 MSC-2156119J US9403799, A14
Type:
Small organic molecule
Emp. Form.:
C29H28N6O2
Mol. Mass.:
492.5716
SMILES:
CN1CCC(COc2cnc(nc2)-c2cccc(Cn3nc(ccc3=O)-c3cccc(c3)C#N)c2)CC1
: