Target
Nuclear receptor subfamily 1 group I member 3
Ligand
BDBM50146175
Substrate
Meas. Tech.
ChEMBL_1555044 (CHEMBL3767622)
IC50
116±n/a nM
Citation
 Lin, WYang, LChai, SCLu, YChen, T Development of CINPA1 analogs as novel and potent inverse agonists of constitutive androstane receptor. Eur J Med Chem 108:505-28 (2016)  
Target
Name:
Nuclear receptor subfamily 1 group I member 3
Synonyms:
CAR NR1I3_HUMAN
Type:
PROTEIN
Mol. Mass.:
39953.17
Organism:
Homo sapiens (Human)
Description:
ChEMBL_1434936
Residue:
352
  
Inhibitor
Name:
BDBM50146175
Synonyms:
CHEMBL3763569
Type:
Small organic molecule
Emp. Form.:
C24H30N2O4
Mol. Mass.:
410.506
SMILES:
CC(C)OCC(=O)N1c2ccccc2CCc2ccc(NC(=O)OC(C)(C)C)cc12
: