Target
Orexin receptor type 2
Ligand
BDBM50148571
Substrate
Meas. Tech.
ChEMBL_1558140 (CHEMBL3771845)
IC50
18±n/a nM
Citation
 Roecker, AJCox, CDColeman, PJ Orexin Receptor Antagonists: New Therapeutic Agents for the Treatment of Insomnia. J Med Chem 59:504-30 (2016)  
Target
Name:
Orexin receptor type 2
Synonyms:
HCRTR2 OX2R_HUMAN Orexin receptor type 2 (OR-2) Orexin receptor type 2 (OX2R) Ox-2-R | Ox2-R
Type:
Protein
Mol. Mass.:
50710.53
Organism:
Homo sapiens (Human)
Description:
O43614
Residue:
444
  
Inhibitor
Name:
BDBM50148571
Synonyms:
CHEMBL3770745
Type:
Small organic molecule
Emp. Form.:
C22H24N6O2
Mol. Mass.:
404.465
SMILES:
CCN(CCN(C)c1nc2ccccc2o1)C(=O)c1cc(C)ccc1-n1nccn1
: