Target
Orexin receptor type 2
Ligand
BDBM50292929
Substrate
Meas. Tech.
ChEMBL_1558157 (CHEMBL3772001)
IC50
8.0±n/a nM
Citation
 Roecker, AJCox, CDColeman, PJ Orexin Receptor Antagonists: New Therapeutic Agents for the Treatment of Insomnia. J Med Chem 59:504-30 (2016)  
Target
Name:
Orexin receptor type 2
Synonyms:
HCRTR2 OX2R_HUMAN Orexin receptor type 2 (OR-2) Orexin receptor type 2 (OX2R) Ox-2-R | Ox2-R
Type:
Protein
Mol. Mass.:
50710.53
Organism:
Homo sapiens (Human)
Description:
O43614
Residue:
444
  
Inhibitor
Name:
BDBM50292929
Synonyms:
CHEMBL455136 | almorexant
Type:
Small organic molecule
Emp. Form.:
C29H31F3N2O3
Mol. Mass.:
512.5632
SMILES:
CNC(=O)[C@H](N1CCc2cc(OC)c(OC)cc2[C@@H]1CCc1ccc(cc1)C(F)(F)F)c1ccccc1
: