Target
Rho-associated protein kinase 1
Ligand
BDBM50087135
Substrate
Meas. Tech.
ChEMBL_1556365 (CHEMBL3772096)
IC50
51±n/a nM
Citation
 Donegan, RKLieberman, RL Discovery of Molecular Therapeutics for Glaucoma: Challenges, Successes, and Promising Directions. J Med Chem 59:788-809 (2016)  
Target
Name:
Rho-associated protein kinase 1
Synonyms:
ROCK-I ROCK1_HUMAN Rho-associated protein kinase Rho-associated, coiled-coil-containing protein kinase 1 Rho-kinase (ROCK I) p160 ROCK-1 | p160ROCK
Type:
Serine/threonine-protein kinase
Mol. Mass.:
158156.77
Organism:
Homo sapiens (Human)
Description:
Q13464
Residue:
1354
  
Inhibitor
Name:
BDBM50087135
Synonyms:
CHEMBL3426621
Type:
Small organic molecule
Emp. Form.:
C15H18FN3O2S
Mol. Mass.:
323.386
SMILES:
C[C@H]1CNCCCN1S(=O)(=O)c1cccc2cncc(F)c12
: