Target
Bromodomain-containing protein 4
Ligand
BDBM50103503
Substrate
Meas. Tech.
ChEMBL_1556548 (CHEMBL3773029)
Kd
303±n/a nM
Citation
 Baud, MGLin-Shiao, EZengerle, MTallant, CCiulli, A New Synthetic Routes to Triazolo-benzodiazepine Analogues: Expanding the Scope of the Bump-and-Hole Approach for Selective Bromo and Extra-Terminal (BET) Bromodomain Inhibition. J Med Chem 59:1492-500 (2016)  
Target
Name:
Bromodomain-containing protein 4
Synonyms:
BRD4 Bromodomain-containing protein 4 (BRD4) Protein HUNK1
Type:
Protein
Mol. Mass.:
152264.84
Organism:
Homo sapiens (Human)
Description:
O60885
Residue:
1362
  
Inhibitor
Name:
BDBM50103503
Synonyms:
CHEMBL2393130 | US11117865, Compound RVX-208
Type:
Small organic molecule
Emp. Form.:
C20H22N2O5
Mol. Mass.:
370.3991
SMILES:
COc1cc(OC)c2c(c1)nc([nH]c2=O)-c1cc(C)c(OCCO)c(C)c1
: