Target
Bromodomain-containing protein 2
Ligand
BDBM50148604
Substrate
Meas. Tech.
ChEMBL_1556401 (CHEMBL3772275)
Kd
45±n/a nM
Citation
 Baud, MGLin-Shiao, EZengerle, MTallant, CCiulli, A New Synthetic Routes to Triazolo-benzodiazepine Analogues: Expanding the Scope of the Bump-and-Hole Approach for Selective Bromo and Extra-Terminal (BET) Bromodomain Inhibition. J Med Chem 59:1492-500 (2016)  
Target
Name:
Bromodomain-containing protein 2
Synonyms:
BRD2 Bromodomain and extra-terminal motif (BET) Bromodomain-containing protein 2 (BRD2) RING3
Type:
Protein
Mol. Mass.:
88085.95
Organism:
Homo sapiens (Human)
Description:
P25440
Residue:
801
  
Inhibitor
Name:
BDBM50148604
Synonyms:
CHEMBL3770576
Type:
Small organic molecule
Emp. Form.:
C23H21N5O3
Mol. Mass.:
415.4445
SMILES:
COC(=O)CC1N=C(c2cc(OC)ccc2-n2c(C)nnc12)c1cccc2[nH]ccc12
: