Target
Histone deacetylase 1
Ligand
BDBM50148607
Substrate
Meas. Tech.
ChEMBL_1556877 (CHEMBL3771759)
IC50
17460±n/a nM
Citation
 Senger, JMelesina, JMarek, MRomier, COehme, IWitt, OSippl, WJung, M Synthesis and Biological Investigation of Oxazole Hydroxamates as Highly Selective Histone Deacetylase 6 (HDAC6) Inhibitors. J Med Chem 59:1545-55 (2016)  
Target
Name:
Histone deacetylase 1
Synonyms:
Cereblon/Histone deacetylase 1 HDAC1 Histone deacetylase 1 (HDAC1) RPD3L1
Type:
Enzyme
Mol. Mass.:
55090.27
Organism:
Homo sapiens (Human)
Description:
Q13547
Residue:
482
  
Inhibitor
Name:
BDBM50148607
Synonyms:
CHEMBL3769683
Type:
Small organic molecule
Emp. Form.:
C10H7BrN2O2S
Mol. Mass.:
299.144
SMILES:
ONC(=O)c1csc(n1)-c1ccc(Br)cc1
: