Target
Histone deacetylase 1
Ligand
BDBM50148630
Substrate
Meas. Tech.
ChEMBL_1556979 (CHEMBL3772310)
IC50
3480±n/a nM
Citation
 Reddy, DNBallante, FChuang, TPirolli, AMarrocco, BMarshall, GR Design and Synthesis of Simplified Largazole Analogues as Isoform-Selective Human Lysine Deacetylase Inhibitors. J Med Chem 59:1613-33 (2016)  
Target
Name:
Histone deacetylase 1
Synonyms:
Cereblon/Histone deacetylase 1 HDAC1 Histone deacetylase 1 (HDAC1) RPD3L1
Type:
Enzyme
Mol. Mass.:
55090.27
Organism:
Homo sapiens (Human)
Description:
Q13547
Residue:
482
  
Inhibitor
Name:
BDBM50148630
Synonyms:
CHEMBL3771206
Type:
Small organic molecule
Emp. Form.:
C26H33N3O5S2
Mol. Mass.:
531.687
SMILES:
CC(C)[C@@H]1NC(=O)[C@]2(C)CSC(=N2)c2ccc(CNC(=O)C[C@H](OC1=O)\C=C\CCSC(C)=O)cc2
: