Target
Serine/threonine-protein kinase PAK 1
Ligand
BDBM50148929
Substrate
Meas. Tech.
ChEMBL_1557608 (CHEMBL3772525)
Ki
6.1±n/a nM
Citation
 Ndubaku, COCrawford, JJDrobnick, JAliagas, ICampbell, DDong, PDornan, LMDuron, SEpler, JGazzard, LHeise, CEHoeflich, KPJakubiak, DLa, HLee, WLin, BLyssikatos, JPMaksimoska, JMarmorstein, RMurray, LJO'Brien, TOh, ARamaswamy, SWang, WZhao, XZhong, YBlackwood, ERudolph, J Design of Selective PAK1 Inhibitor G-5555: Improving Properties by Employing an Unorthodox Low-pK a Polar Moiety. ACS Med Chem Lett 6:1241-6 (2015)  
Target
Name:
Serine/threonine-protein kinase PAK 1
Synonyms:
2.7.11.1 Cell division control protein 42 homolog PAK-1 PAK1_HUMAN p21-activated kinase 1 | p65-PAK
Type:
Mol. Mass.:
60640.15
Organism:
Homo sapiens (Human)
Description:
Q13153
Residue:
545
  
Inhibitor
Name:
BDBM50148929
Synonyms:
CHEMBL3770369
Type:
Small organic molecule
Emp. Form.:
C24H26ClN7O
Mol. Mass.:
463.963
SMILES:
CCNc1ncc2cc(-c3ccc(cc3Cl)-c3cncc(C)n3)c(=O)n(CCCCN)c2n1
: