Target
Solute carrier family 13 member 5
Ligand
BDBM50149294
Substrate
Meas. Tech.
ChEMBL_1557733 (CHEMBL3773092)
IC50
16200±n/a nM
Citation
 Huard, KGosset, JRMontgomery, JIGilbert, AHayward, MMMagee, TVCabral, SUccello, DPBahnck, KBrown, JPurkal, JGorgoglione, MLanba, AFutatsugi, KHerr, MGenung, NEAspnes, GPolivkova, JGarcia-Irizarry, CNLi, QCanterbury, DNiosi, MVera, NBLi, ZKhunte, BSiderewicz, JRolph, TErion, DM Optimization of a Dicarboxylic Series for in Vivo Inhibition of Citrate Transport by the Solute Carrier 13 (SLC13) Family. J Med Chem 59:1165-75 (2016)  
Target
Name:
Solute carrier family 13 member 5
Synonyms:
NACT S13A5_HUMAN Sodium-coupled citrate transporter Solute carrier family 13 member 5
Type:
PROTEIN
Mol. Mass.:
63069.06
Organism:
Homo sapiens (Human)
Description:
ChEMBL_116736
Residue:
568
  
Inhibitor
Name:
BDBM50149294
Synonyms:
CHEMBL3769578
Type:
Small organic molecule
Emp. Form.:
C16H22O5
Mol. Mass.:
294.3429
SMILES:
CC(C)(C)c1ccc(CC[C@@](O)(CC(O)=O)C(O)=O)cc1
: