Target
Solute carrier family 13 member 5
Ligand
BDBM50149244
Substrate
Meas. Tech.
ChEMBL_1557738 (CHEMBL3773097)
IC50
210±n/a nM
Citation
 Huard, KGosset, JRMontgomery, JIGilbert, AHayward, MMMagee, TVCabral, SUccello, DPBahnck, KBrown, JPurkal, JGorgoglione, MLanba, AFutatsugi, KHerr, MGenung, NEAspnes, GPolivkova, JGarcia-Irizarry, CNLi, QCanterbury, DNiosi, MVera, NBLi, ZKhunte, BSiderewicz, JRolph, TErion, DM Optimization of a Dicarboxylic Series for in Vivo Inhibition of Citrate Transport by the Solute Carrier 13 (SLC13) Family. J Med Chem 59:1165-75 (2016)  
Target
Name:
Solute carrier family 13 member 5
Synonyms:
Na(+)/citrate cotransporter S13A5_MOUSE Sodium-coupled citrate transporter Solute carrier family 13 member 5
Type:
PROTEIN
Mol. Mass.:
63827.44
Organism:
Mus musculus
Description:
ChEMBL_116737
Residue:
572
  
Inhibitor
Name:
BDBM50149244
Synonyms:
CHEMBL3771118
Type:
Small organic molecule
Emp. Form.:
C13H17NO6
Mol. Mass.:
283.2772
SMILES:
COc1ncc(C)cc1CC[C@@](O)(CC(O)=O)C(O)=O
: