Target
Cholinesterase
Ligand
BDBM50149957
Substrate
Meas. Tech.
ChEMBL_1558460 (CHEMBL3773336)
IC50
20110±n/a nM
Citation
 Pejchal, V?tepánková, ?Pejchalová, MKrálovec, KHavelek, RRu?icková, ZAjani, HLo, RLep?ík, M Synthesis, structural characterization, docking, lipophilicity and cytotoxicity of 1-[(1R)-1-(6-fluoro-1,3-benzothiazol-2-yl)ethyl]-3-alkyl carbamates, novel acetylcholinesterase and butyrylcholinesterase pseudo-irreversible inhibitors. Bioorg Med Chem 24:1560-72 (2016)  
Target
Name:
Cholinesterase
Synonyms:
BCHE CHLE_HORSE | Cholinesterase
Type:
Enzyme
Mol. Mass.:
65643.35
Organism:
Equus caballus (Horse)
Description:
P81908
Residue:
574
  
Inhibitor
Name:
BDBM50149957
Synonyms:
CHEMBL3769730
Type:
Small organic molecule
Emp. Form.:
C12H13FN2O2S
Mol. Mass.:
268.307
SMILES:
CCOC(=O)N[C@H](C)c1nc2ccc(F)cc2s1
: