Target
Histone deacetylase 1
Ligand
BDBM50151281
Substrate
Meas. Tech.
ChEMBL_1559108 (CHEMBL3774115)
IC50
19±n/a nM
Citation
 Gong, CJGao, AHZhang, YMSu, MBChen, FSheng, LZhou, YBLi, JYLi, JNan, FJ Design, synthesis and biological evaluation of bisthiazole-based trifluoromethyl ketone derivatives as potent HDAC inhibitors with improved cellular efficacy. Eur J Med Chem 112:81-90 (2016)  
Target
Name:
Histone deacetylase 1
Synonyms:
Cereblon/Histone deacetylase 1 HDAC1 Histone deacetylase 1 (HDAC1) RPD3L1
Type:
Enzyme
Mol. Mass.:
55090.27
Organism:
Homo sapiens (Human)
Description:
Q13547
Residue:
482
  
Inhibitor
Name:
BDBM50151281
Synonyms:
CHEMBL3770504
Type:
Small organic molecule
Emp. Form.:
C20H22F3N3O2S2
Mol. Mass.:
457.533
SMILES:
FC(F)(F)C(=O)CCCCNC(=O)c1nc(sc1C1CC1)-c1nc2CCCCc2s1
: