Target
Lysine-specific demethylase 2A
Ligand
BDBM26113
Substrate
Meas. Tech.
ChEMBL_1561038 (CHEMBL3776334)
IC50
12800±n/a nM
Citation
 Korczynska, MLe, DDYounger, NGregori-Puigjané, ETumber, AKrojer, TVelupillai, SGileadi, CNowak, RPIwasa, EPollock, SBOrtiz Torres, IOppermann, UShoichet, BKFujimori, DG Docking and Linking of Fragments To Discover Jumonji Histone Demethylase Inhibitors. J Med Chem 59:1580-98 (2016)  
Target
Name:
Lysine-specific demethylase 2A
Synonyms:
AA1-1162 F-box and leucine-rich repeat protein 11 FBL7 Homo sapiens lysine demethylase 2A (KDM2A) KDM2A KIAA1004 Lysine-specific demethylase 2A (KDM2A) | NM_012308
Type:
Enzyme Catalytic Domain
Mol. Mass.:
132809.04
Organism:
Homo sapiens (Human)
Description:
Residue:
1162
  
Inhibitor
Name:
BDBM26113
Synonyms:
2,4 PDCA pyridine carboxylate, 6a | pyridine-2,4-dicarboxylic acid
Type:
Small organic molecule
Emp. Form.:
C7H5NO4
Mol. Mass.:
167.1189
SMILES:
OC(=O)c1ccnc(c1)C(O)=O
: