Target
Histone acetyltransferase KAT2A
Ligand
BDBM50151658
Substrate
Meas. Tech.
ChEMBL_1561466 (CHEMBL3779400)
IC50
33900±n/a nM
Citation
 Simon, RPRobaa, DAlhalabi, ZSippl, WJung, M KATching-Up on Small Molecule Modulators of Lysine Acetyltransferases. J Med Chem 59:1249-70 (2016)  
Target
Name:
Histone acetyltransferase KAT2A
Synonyms:
GCN5 GCN5L2 HGCN5 Histone acetyltransferase KAT2A HsGCN5 KAT2A_HUMAN STAF97
Type:
PROTEIN
Mol. Mass.:
93956.22
Organism:
Homo sapiens (Human)
Description:
ChEMBL_100876
Residue:
837
  
Inhibitor
Name:
BDBM50151658
Synonyms:
CHEMBL3775671
Type:
Small organic molecule
Emp. Form.:
C15H15NO5S
Mol. Mass.:
321.348
SMILES:
[#6]-[#8]-c1ccc(cc1)S(=O)(=O)[#8]\[#7]=[#6]-1/[#6]=[#6](-[#6])-[#6](=O)-[#6](-[#6])=[#6]-1
: