Target
Cannabinoid receptor 1
Ligand
BDBM50152114
Substrate
Meas. Tech.
ChEMBL_1565145 (CHEMBL3782503)
Ki
>40000±n/a nM
Citation
 Deiana, VGómez-Cañas, MPazos, MRFernández-Ruiz, JAsproni, BCichero, EFossa, PMuñoz, EDeligia, FMurineddu, GGarcía-Arencibia, MPinna, GA Tricyclic pyrazoles. Part 8. Synthesis, biological evaluation and modelling of tricyclic pyrazole carboxamides as potential CB2 receptor ligands with antagonist/inverse agonist properties. Eur J Med Chem 112:66-80 (2016)  
Target
Name:
Cannabinoid receptor 1
Synonyms:
CANN6 CB-R CNR CNR1_HUMAN Cannabinoid receptor Cannabinoid receptor 1 (brain)
Type:
G Protein-Coupled Receptor (GPCR)
Mol. Mass.:
52868.96
Organism:
Homo sapiens (Human)
Description:
P21554
Residue:
472
  
Inhibitor
Name:
BDBM50152114
Synonyms:
CHEMBL3780608
Type:
Small organic molecule
Emp. Form.:
C31H32Cl3N3O
Mol. Mass.:
568.964
SMILES:
Cl.C[C@]12CCC(C1)C(C)(C)C2NC(=O)c1nn(-c2ccc(Cl)cc2Cl)c2c1ccc1cc(ccc21)C1CC1
: