Target
Platelet-derived growth factor receptor alpha
Ligand
BDBM50152595
Substrate
Meas. Tech.
ChEMBL_1564848 (CHEMBL3784666)
IC50
9.0±n/a nM
Citation
 Simov, VDeshmukh, SVDinsmore, CJElwood, FFernandez, RBGarcia, YGibeau, CGunaydin, HJung, JKatz, JDKraybill, BLapointe, BPatel, SBSiu, TSu, HYoung, JR Structure-based design and development of (benz)imidazole pyridones as JAK1-selective kinase inhibitors. Bioorg Med Chem Lett 26:1803-8 (2016)  
Target
Name:
Platelet-derived growth factor receptor alpha
Synonyms:
Alpha-type platelet-derived growth factor receptor PDGFRA PGFRA_HUMAN Platelet-derived growth factor receptor alpha (PDGFRA) RHEPDGFRA
Type:
Protein
Mol. Mass.:
122633.38
Organism:
Homo sapiens (Human)
Description:
P16234
Residue:
1089
  
Inhibitor
Name:
BDBM50152595
Synonyms:
CHEMBL3780091
Type:
Small organic molecule
Emp. Form.:
C18H21N5O
Mol. Mass.:
323.3922
SMILES:
N[C@H]1CC[C@H](CC1)Nc1cc[nH]c(=O)c1-c1nc2ccccc2[nH]1
: