Target
Non-receptor tyrosine-protein kinase TYK2
Ligand
BDBM50355501
Substrate
Meas. Tech.
ChEMBL_1564736 (CHEMBL3784141)
IC50
0.720000±n/a nM
Citation
 Simov, VDeshmukh, SVDinsmore, CJElwood, FFernandez, RBGarcia, YGibeau, CGunaydin, HJung, JKatz, JDKraybill, BLapointe, BPatel, SBSiu, TSu, HYoung, JR Structure-based design and development of (benz)imidazole pyridones as JAK1-selective kinase inhibitors. Bioorg Med Chem Lett 26:1803-8 (2016)  
Target
Name:
Non-receptor tyrosine-protein kinase TYK2
Synonyms:
Non-receptor tyrosine-protein kinase TYK2 (TYK2) TYK2_HUMAN | Tyrosine-protein kinase TYK2
Type:
Protein
Mol. Mass.:
133666.03
Organism:
Homo sapiens (Human)
Description:
P29597
Residue:
1187
  
Inhibitor
Name:
BDBM50355501
Synonyms:
INCB-018424 RUXOLITINIB PHOSPHATE US10766894, Compound TABLE 1.1 US11203595, TABLE 1.1 | US11279703, TABLE 6.147
Type:
Small organic molecule
Emp. Form.:
C17H18N6
Mol. Mass.:
306.365
SMILES:
N#CC[C@H](C1CCCC1)n1cc(cn1)-c1ncnc2[nH]ccc12
: