Target
Non-receptor tyrosine-protein kinase TYK2
Ligand
BDBM50152595
Substrate
Meas. Tech.
ChEMBL_1564736 (CHEMBL3784141)
IC50
1.5±n/a nM
Citation
 Simov, VDeshmukh, SVDinsmore, CJElwood, FFernandez, RBGarcia, YGibeau, CGunaydin, HJung, JKatz, JDKraybill, BLapointe, BPatel, SBSiu, TSu, HYoung, JR Structure-based design and development of (benz)imidazole pyridones as JAK1-selective kinase inhibitors. Bioorg Med Chem Lett 26:1803-8 (2016)  
Target
Name:
Non-receptor tyrosine-protein kinase TYK2
Synonyms:
Non-receptor tyrosine-protein kinase TYK2 (TYK2) TYK2_HUMAN | Tyrosine-protein kinase TYK2
Type:
Protein
Mol. Mass.:
133666.03
Organism:
Homo sapiens (Human)
Description:
P29597
Residue:
1187
  
Inhibitor
Name:
BDBM50152595
Synonyms:
CHEMBL3780091
Type:
Small organic molecule
Emp. Form.:
C18H21N5O
Mol. Mass.:
323.3922
SMILES:
N[C@H]1CC[C@H](CC1)Nc1cc[nH]c(=O)c1-c1nc2ccccc2[nH]1
: