Target
RAC-alpha serine/threonine-protein kinase
Ligand
BDBM15169
Substrate
Meas. Tech.
ChEMBL_1565187 (CHEMBL3782579)
IC50
58±n/a nM
Citation
 Desplat, VVincenzi, MLucas, RMoreau, SSavrimoutou, SPinaud, NLesbordes, JPeyrilles, EMarchivie, MRoutier, SSonnet, PRossi, FRonga, LGuillon, J Synthesis and evaluation of the cytotoxic activity of novel ethyl 4-[4-(4-substitutedpiperidin-1-yl)]benzyl-phenylpyrrolo[1,2-a]quinoxaline-carboxylate derivatives in myeloid and lymphoid leukemia cell lines. Eur J Med Chem 113:214-27 (2016)  
Target
Name:
RAC-alpha serine/threonine-protein kinase
Synonyms:
AKT phosphorylation (p-AKT) AKT1/PPP1CA C-AKT PKB alpha Protein kinase B Protein kinase B (Akt 1) Protein kinase B alpha Proto-oncogene Akt (Akt1) Proto-oncogene c-Akt (AKT1) RAC-PK-alpha RAC-alpha serine/threonine-protein kinase (AKT1) | RAC-alpha serine/threonine-protein kinase (pAKT)
Type:
Enzyme
Mol. Mass.:
55681.25
Organism:
Homo sapiens (Human)
Description:
P31749
Residue:
480
  
Inhibitor
Name:
BDBM15169
Synonyms:
1-{1-[(4-{7-phenyl-1H-imidazo[4,5-g]quinoxalin-6-yl}phenyl)methyl]piperidin-4-yl}-2,3-dihydro-1H-1,3-benzodiazol-2-one imidazoquinoxaline | imidazoquinoxaline 16h
Type:
Small organic molecule
Emp. Form.:
C34H29N7O
Mol. Mass.:
551.6404
SMILES:
O=c1[nH]c2ccccc2n1C1CCN(Cc2ccc(cc2)-c2nc3cc4[nH]cnc4cc3nc2-c2ccccc2)CC1
: