Target
Solute carrier family 2, facilitated glucose transporter member 3
Ligand
BDBM50155752
Substrate
Meas. Tech.
ChEMBL_1565338 (CHEMBL3782732)
IC50
120±n/a nM
Citation
 Siebeneicher, HBauser, MBuchmann, BHeisler, IMüller, TNeuhaus, RRehwinkel, HTelser, JZorn, L Identification of novel GLUT inhibitors. Bioorg Med Chem Lett 26:1732-7 (2016)  
Target
Name:
Solute carrier family 2, facilitated glucose transporter member 3
Synonyms:
GLUT-3 GTR3_HUMAN SLC2A3 | Solute carrier family 2, facilitated glucose transporter member 3
Type:
PROTEIN
Mol. Mass.:
53925.15
Organism:
Homo sapiens (Human)
Description:
ChEMBL_101113
Residue:
496
  
Inhibitor
Name:
BDBM50155752
Synonyms:
CHEMBL3780527
Type:
Small organic molecule
Emp. Form.:
C21H26N6O
Mol. Mass.:
378.4707
SMILES:
COc1ccccc1N1CCN(CC1)c1ncnc2n(ncc12)C1CCCC1
: