Target
ATP-dependent translocase ABCB1
Ligand
BDBM50153723
Substrate
Meas. Tech.
ChEBML_1561530
Ki
320±n/a nM
Citation
 Callies, OSánchez-Cañete, MPGamarro, FJiménez, IACastanys, SBazzocchi, IL Optimization by Molecular Fine Tuning of Dihydro-ß-agarofuran Sesquiterpenoids as Reversers of P-Glycoprotein-Mediated Multidrug Resistance. J Med Chem 59:1880-90 (2016)  
Target
Name:
ATP-dependent translocase ABCB1
Synonyms:
ABCB1 MDR1_HUMAN Multidrug resistance protein 1 P-glycoprotein (P-gp) PGY1
Type:
Protein
Mol. Mass.:
141503.50
Organism:
Homo sapiens (Human)
Description:
P08183
Residue:
1280
  
Inhibitor
Name:
BDBM50153723
Synonyms:
CHEMBL3775488
Type:
Small organic molecule
Emp. Form.:
C37H44O10
Mol. Mass.:
648.7393
SMILES:
[H][C@@]12[C@@H](OC(=O)CCC)[C@]3(OC1(C)C)[C@@](C)(O)CC[C@H](OC(C)=O)[C@@]3(C)[C@@H](OC(=O)c1ccccc1)[C@H]2OC(=O)\C=C\c1ccccc1
: