Target
ATP-dependent translocase ABCB1
Ligand
BDBM50154913
Substrate
Meas. Tech.
ChEMBL_1561530 (CHEMBL3776167)
Ki
470±n/a nM
Citation
 Callies, OSánchez-Cañete, MPGamarro, FJiménez, IACastanys, SBazzocchi, IL Optimization by Molecular Fine Tuning of Dihydro-ß-agarofuran Sesquiterpenoids as Reversers of P-Glycoprotein-Mediated Multidrug Resistance. J Med Chem 59:1880-90 (2016)  
Target
Name:
ATP-dependent translocase ABCB1
Synonyms:
ABCB1 MDR1_HUMAN Multidrug resistance protein 1 P-glycoprotein (P-gp) PGY1
Type:
Protein
Mol. Mass.:
141503.50
Organism:
Homo sapiens (Human)
Description:
P08183
Residue:
1280
  
Inhibitor
Name:
BDBM50154913
Synonyms:
CHEMBL3775570
Type:
Small organic molecule
Emp. Form.:
C33H40O9
Mol. Mass.:
580.6653
SMILES:
[H][C@@]12[C@@H](O)[C@]3(OC1(C)C)[C@@](C)(O)CC[C@H](OC(C)=O)[C@@]3(C)[C@@H](OC(=O)c1ccccc1)[C@H]2OC(=O)CCc1ccccc1
: