Target
Prostaglandin G/H synthase 2
Ligand
BDBM50154399
Substrate
Meas. Tech.
ChEMBL_1560773 (CHEMBL3778470)
IC50
13000±n/a nM
Citation
 Tietz, ODzandzi, JBhardwaj, AValliant, JFWuest, F Design and synthesis of [(125)I]Pyricoxib: A novel (125)I-labeled cyclooxygenase-2 (COX-2) inhibitors. Bioorg Med Chem Lett 26:1516-20 (2016)  
Target
Name:
Prostaglandin G/H synthase 2
Synonyms:
COX2 Cyclooxygenase 2 (COX-2) Cyclooxygenase-2 (COX-2 AA) Cyclooxygenase-2 (COX-2) PGH2_HUMAN PHS II Prostaglandin E synthase/G/H synthase 2 Prostaglandin-endoperoxide synthase 2
Type:
Enzyme
Mol. Mass.:
69003.89
Organism:
Homo sapiens (Human)
Description:
Recombinant Cox-2 provided by Cayman (Cayman Chemical Co.,Ann Arbor, MI).
Residue:
604
  
Inhibitor
Name:
BDBM50154399
Synonyms:
CHEMBL3774963
Type:
Small organic molecule
Emp. Form.:
C18H14F3IN4O2S
Mol. Mass.:
534.294
SMILES:
NS(=O)(=O)c1ccc(cc1)-c1cc(nc(NCc2ccc(I)cc2)n1)C(F)(F)F
: