Target
Cyclin-dependent kinase 2/G1/S-specific cyclin-E1
Ligand
BDBM50154929
Substrate
Meas. Tech.
ChEMBL_1561737 (CHEMBL3777409)
IC50
12±n/a nM
Citation
 Vymetalová, LHavlícek, L?turc, ASkrá?ková, ZJorda, RPospí?il, TStrnad, MKry?tof, V 5-Substituted 3-isopropyl-7-[4-(2-pyridyl)benzyl]amino-1(2)H-pyrazolo[4,3-d]pyrimidines with anti-proliferative activity as potent and selective inhibitors of cyclin-dependent kinases. Eur J Med Chem 110:291-301 (2016)  
Target
Name:
Cyclin-dependent kinase 2/G1/S-specific cyclin-E1
Synonyms:
CDK2/CycE CDK2/E Cyclin-Dependent Kinase 2 (CDK2) Cyclin-dependent kinase 2/cyclin E1
Type:
Protein
Mol. Mass.:
Description:
Components:
This complex has 2 components.
Component 1
Name:
Cyclin-dependent kinase 2
Synonyms:
CDK2 CDK2_HUMAN Cell division protein kinase 2 Protein cereblon/Cyclin-dependent kinase 2 | p33 protein kinase
Type:
Enzyme Subunit
Mol. Mass.:
33938.17
Organism:
Homo sapiens (Human)
Description:
P24941
Residue:
298
  
Component 2
Name:
G1/S-specific cyclin-E1
Synonyms:
CCNE CCNE1_HUMAN
Type:
Enzyme Subunit
Mol. Mass.:
47073.17
Organism:
Homo sapiens (Human)
Description:
Residue:
410
  
Inhibitor
Name:
BDBM50154929
Synonyms:
CHEMBL3775677
Type:
Small organic molecule
Emp. Form.:
C23H27N7O2
Mol. Mass.:
433.5062
SMILES:
CC(C)c1n[nH]c2c(NCc3ccc(cc3)-c3ccccn3)nc(NCC(O)CO)nc12
: