Target
Serine/threonine-protein kinase pim-1
Ligand
BDBM50161838
Substrate
Meas. Tech.
ChEMBL_1570460 (CHEMBL3794687)
Ki
<1±n/a nM
Citation
 Nishiguchi, GABurger, MTHan, WLan, JAtallah, GTamez, VLindvall, MBellamacina, CGarcia, PFeucht, PZavorotinskaya, TDai, YWong, K Design, synthesis and structure activity relationship of potent pan-PIM kinase inhibitors derived from the pyridyl carboxamide scaffold. Bioorg Med Chem Lett 26:2328-32 (2016)  
Target
Name:
Serine/threonine-protein kinase pim-1
Synonyms:
PIM-1 Kinase PIM1_HUMAN Serine/threonine-protein kinase (PIM1) Serine/threonine-protein kinase PIM1 | Serine/threonine-protein kinase pim-1 (PIM1)
Type:
Protein
Mol. Mass.:
35681.82
Organism:
Homo sapiens (Human)
Description:
P11309
Residue:
313
  
Inhibitor
Name:
BDBM50161838
Synonyms:
CHEMBL3792922
Type:
Small organic molecule
Emp. Form.:
C19H16N8OS
Mol. Mass.:
404.448
SMILES:
Cc1cc(nc(N)n1)-c1ccncc1NC(=O)c1nc(ccc1N)-c1nccs1
: