Target
Prostaglandin E2 receptor EP3 subtype
Ligand
BDBM50156472
Substrate
Meas. Tech.
ChEMBL_1570609 (CHEMBL3794977)
EC50
>10000±n/a nM
Citation
 Ogawa, SWatanabe, TMoriyuki, KGoto, YYamane, SWatanabe, ATsuboi, KKinoshita, AOkada, TTakeda, HTani, KMaruyama, T Structural optimization and structure-functional selectivity relationship studies of G protein-biased EP2 receptor agonists. Bioorg Med Chem Lett 26:2446-9 (2016)  
Target
Name:
Prostaglandin E2 receptor EP3 subtype
Synonyms:
PE2R3_HUMAN PGE2-R Prostaglandin E2 receptor Prostaglandin E2 receptor EP3 subtype (EP3) Prostaglandin E2 receptor EP3D subtype (EP3D) | Prostanoid EP3 receptor
Type:
Enzyme
Mol. Mass.:
43335.03
Organism:
Homo sapiens (Human)
Description:
P43115
Residue:
390
  
Inhibitor
Name:
BDBM50156472
Synonyms:
CHEMBL3793167
Type:
Small organic molecule
Emp. Form.:
C20H21ClFNO4S
Mol. Mass.:
425.901
SMILES:
[H][C@]12C[C@H](F)[C@H](COc3ccc(Cl)c(C)c3)[C@@]1([H])CC[C@@H](O2)c1nc(cs1)C(O)=O
: