Target
Acetylcholinesterase
Ligand
BDBM50156810
Substrate
Meas. Tech.
ChEMBL_1571406 (CHEMBL3796602)
IC50
8500±n/a nM
Citation
 Pan, WHu, KBai, PYu, LMa, QLi, TZhang, XChen, CPeng, KLiu, WSang, Z Design, synthesis and evaluation of novel ferulic acid-memoquin hybrids as potential multifunctional agents for the treatment of Alzheimer's disease. Bioorg Med Chem Lett 26:2539-43 (2016)  
Target
Name:
Acetylcholinesterase
Synonyms:
ACES_ELEEL Acetylcholinesterase (EeAChE) | ache
Type:
Enzyme
Mol. Mass.:
71812.79
Organism:
Electrophorus electricus (Electric eel)
Description:
Residue:
633
  
Inhibitor
Name:
BDBM50156810
Synonyms:
CHEMBL3792478
Type:
Small organic molecule
Emp. Form.:
C25H34N2O4
Mol. Mass.:
426.5485
SMILES:
COc1cc(\C=C\C(=O)NCCCCCCN(C)Cc2ccccc2OC)ccc1O
: