Target
D(4) dopamine receptor
Ligand
BDBM50156958
Substrate
Meas. Tech.
ChEMBL_1571915 (CHEMBL3796307)
Ki
18±n/a nM
Citation
 Witt, JOMcCollum, ALHurtado, MAHuseman, EDJeffries, DETemple, KJPlumley, HCBlobaum, ALLindsley, CWHopkins, CR Synthesis and characterization of a series of chiral alkoxymethyl morpholine analogs as dopamine receptor 4 (D4R) antagonists. Bioorg Med Chem Lett 26:2481-8 (2016)  
Target
Name:
D(4) dopamine receptor
Synonyms:
D(2C) dopamine receptor DOPAMINE D4.2 DRD4 Dopamine D4 receptor
Type:
Enzyme
Mol. Mass.:
48373.19
Organism:
Homo sapiens (Human)
Description:
P21917
Residue:
419
  
Inhibitor
Name:
BDBM50156958
Synonyms:
CHEMBL3792556
Type:
Small organic molecule
Emp. Form.:
C22H23NO2
Mol. Mass.:
333.4235
SMILES:
C(Oc1ccccc1)[C@@H]1CN(Cc2ccc3ccccc3c2)CCO1
: