Target
Serine protease hepsin
Ligand
BDBM50158159
Substrate
Meas. Tech.
ChEMBL_1565753 (CHEMBL3782551)
Ki
560±n/a nM
Citation
 Venukadasula, PKOwusu, BYBansal, NRoss, LJHobrath, JVBao, DTruss, JWStackhouse, MMessick, TEKlampfer, LGalemmo, RA Design and Synthesis of Nonpeptide Inhibitors of Hepatocyte Growth Factor Activation. ACS Med Chem Lett 7:177-81 (2016)  
Target
Name:
Serine protease hepsin
Synonyms:
HEPS_HUMAN Hepsin TMPRSS1 Transmembrane protease, serine 1
Type:
Enzyme
Mol. Mass.:
45016.98
Organism:
Homo sapiens (Human)
Description:
Human deglycosylated hepsin was expressed in Pichia pastoris.
Residue:
417
  
Inhibitor
Name:
BDBM50158159
Synonyms:
CHEMBL3780036
Type:
Small organic molecule
Emp. Form.:
C32H39N5O2
Mol. Mass.:
525.6844
SMILES:
NC(=N)c1cccc(c1)N1CC(COCc2ccccc2)CN(CC2CCN(Cc3ccccc3)CC2)C1=O
: