Target
Prothrombin
Ligand
BDBM50071945
Substrate
Meas. Tech.
ChEMBL_1565756 (CHEMBL3782596)
Ki
>100000±n/a nM
Citation
 Venukadasula, PKOwusu, BYBansal, NRoss, LJHobrath, JVBao, DTruss, JWStackhouse, MMessick, TEKlampfer, LGalemmo, RA Design and Synthesis of Nonpeptide Inhibitors of Hepatocyte Growth Factor Activation. ACS Med Chem Lett 7:177-81 (2016)  
Target
Name:
Prothrombin
Synonyms:
Activation peptide fragment 1 Coagulation factor II Prothrombin precursor Thrombin heavy chain | Thrombin light chain
Type:
Protein
Mol. Mass.:
70029.57
Organism:
Homo sapiens (Human)
Description:
P00734
Residue:
622
  
Inhibitor
Name:
BDBM50071945
Synonyms:
3-[3-(1-Benzyl-piperidin-4-yl)-ureido]-benzamidine | CHEMBL327254
Type:
Small organic molecule
Emp. Form.:
C20H25N5O
Mol. Mass.:
351.4454
SMILES:
NC(=N)c1cccc(NC(=O)NC2CCN(Cc3ccccc3)CC2)c1
: