Target
Suppressor of tumorigenicity 14 protein
Ligand
BDBM50158161
Substrate
Meas. Tech.
ChEMBL_1565752 (CHEMBL3782550)
Ki
470±n/a nM
Citation
 Venukadasula, PKOwusu, BYBansal, NRoss, LJHobrath, JVBao, DTruss, JWStackhouse, MMessick, TEKlampfer, LGalemmo, RA Design and Synthesis of Nonpeptide Inhibitors of Hepatocyte Growth Factor Activation. ACS Med Chem Lett 7:177-81 (2016)  
Target
Name:
Suppressor of tumorigenicity 14 protein
Synonyms:
Epithin MT-SP1 PRSS14 SNC19 ST14_HUMAN Suppressor of tumorigenicity 14 protein TADG15
Type:
Single-pass type II membrane protein
Mol. Mass.:
94769.23
Organism:
Homo sapiens (Human)
Description:
Q9Y5Y6
Residue:
855
  
Inhibitor
Name:
BDBM50158161
Synonyms:
CHEMBL3781405
Type:
Small organic molecule
Emp. Form.:
C32H38N6O2
Mol. Mass.:
538.6831
SMILES:
NC(=N)c1cccc(c1)N1CC(CNC(=O)c2ccccc2)CN(CC2CCN(Cc3ccccc3)CC2)C1=O
: