Target
Prothrombin
Ligand
BDBM50158164
Substrate
Meas. Tech.
ChEMBL_1565756 (CHEMBL3782596)
Ki
82200±n/a nM
Citation
 Venukadasula, PKOwusu, BYBansal, NRoss, LJHobrath, JVBao, DTruss, JWStackhouse, MMessick, TEKlampfer, LGalemmo, RA Design and Synthesis of Nonpeptide Inhibitors of Hepatocyte Growth Factor Activation. ACS Med Chem Lett 7:177-81 (2016)  
Target
Name:
Prothrombin
Synonyms:
Activation peptide fragment 1 Coagulation factor II Prothrombin precursor Thrombin heavy chain | Thrombin light chain
Type:
Protein
Mol. Mass.:
70029.57
Organism:
Homo sapiens (Human)
Description:
P00734
Residue:
622
  
Inhibitor
Name:
BDBM50158164
Synonyms:
CHEMBL3780039
Type:
Small organic molecule
Emp. Form.:
C25H33N5O
Mol. Mass.:
419.5624
SMILES:
CC1CN(Cc2ccc(cc2)C(N)=N)C(=O)N(C1)C1CCN(Cc2ccccc2)CC1
: