Target
Prothrombin
Ligand
BDBM50158101
Substrate
Meas. Tech.
ChEMBL_1565756 (CHEMBL3782596)
Ki
13400±n/a nM
Citation
 Venukadasula, PKOwusu, BYBansal, NRoss, LJHobrath, JVBao, DTruss, JWStackhouse, MMessick, TEKlampfer, LGalemmo, RA Design and Synthesis of Nonpeptide Inhibitors of Hepatocyte Growth Factor Activation. ACS Med Chem Lett 7:177-81 (2016)  
Target
Name:
Prothrombin
Synonyms:
Activation peptide fragment 1 Coagulation factor II Prothrombin precursor Thrombin heavy chain | Thrombin light chain
Type:
Protein
Mol. Mass.:
70029.57
Organism:
Homo sapiens (Human)
Description:
P00734
Residue:
622
  
Inhibitor
Name:
BDBM50158101
Synonyms:
CHEMBL3781673
Type:
Small organic molecule
Emp. Form.:
C31H38N6O3S
Mol. Mass.:
574.737
SMILES:
NC(=N)c1cccc(c1)N1CC(CN(CC2CCN(Cc3ccccc3)CC2)C1=O)NS(=O)(=O)Cc1ccccc1
: