Target
Prothrombin
Ligand
BDBM50157632
Substrate
Meas. Tech.
ChEMBL_1565756 (CHEMBL3782596)
Ki
11600±n/a nM
Citation
 Venukadasula, PKOwusu, BYBansal, NRoss, LJHobrath, JVBao, DTruss, JWStackhouse, MMessick, TEKlampfer, LGalemmo, RA Design and Synthesis of Nonpeptide Inhibitors of Hepatocyte Growth Factor Activation. ACS Med Chem Lett 7:177-81 (2016)  
Target
Name:
Prothrombin
Synonyms:
Activation peptide fragment 1 Coagulation factor II Prothrombin precursor Thrombin heavy chain | Thrombin light chain
Type:
Protein
Mol. Mass.:
70029.57
Organism:
Homo sapiens (Human)
Description:
P00734
Residue:
622
  
Inhibitor
Name:
BDBM50157632
Synonyms:
CHEMBL3781349
Type:
Small organic molecule
Emp. Form.:
C25H33N5O
Mol. Mass.:
419.5624
SMILES:
CC1CN(CC2CCN(Cc3ccccc3)CC2)C(=O)N(C1)c1cccc(c1)C(N)=N
: