Target
Sigma non-opioid intracellular receptor 1
Ligand
BDBM50034167
Substrate
Meas. Tech.
ChEMBL_1569753 (CHEMBL3791697)
Ki
59±n/a nM
Citation
 Lan, YSongyang, YZhang, LPeng, YSong, J Synthesis and biological evaluation of novel 6,7-dihydro-5H-cyclopenta[d]pyrimidine and 5,6,7,8-tetrahydroquinazoline derivatives as sigma-1 (s1) receptor antagonists for the treatment of pain. Bioorg Med Chem Lett 26:2051-6 (2016)  
Target
Name:
Sigma non-opioid intracellular receptor 1
Synonyms:
OPRS1 SIGMAR1 Sigma non-opioid intracellular receptor 1 Sigma1-receptor Sterol isomerase-like protein
Type:
Protein
Mol. Mass.:
25307.17
Organism:
Cavia porcellus (Guinea pig)
Description:
Q60492
Residue:
223
  
Inhibitor
Name:
BDBM50034167
Synonyms:
CHEMBL3359232
Type:
Small organic molecule
Emp. Form.:
C20H25N3O
Mol. Mass.:
323.432
SMILES:
C(COc1nc(nc2CCCc12)-c1ccccc1)CN1CCCC1
: